• Problems in abstract algebra wadsworth pdf
    Doordash strategy and operations interview
2010 gmc yukon xl denali specs
Vikkstar123 warzone loadout m4a1
450 hp 340 moparChiots yorkshire a vendre quebec
Mhw blue damage numbers
All format converter for pcData engineer interview preparation
Sultan abdul hamid episode 57 english subtitles
Todobakudeku ao3Best baseball bats for 11 year olds
Szechuan spice gluten free
Cornell class of 2024 acceptance rateHonda swot analysis
Roll20 macro generatorIndex of spartacus season 4
Code Name Description Comment; 0: OK: Indicates successful completion of the operation. 1: EOF: An attempt to read past the end-of-file was made; or, there are no more directory entries to return.

Yarn error command failed with exit code 134

  • Don't panic, but a mostly harmless error occurred and Canu stopped. I added code markup to your post for increased readability. You can do this by selecting the text and clicking the 101010 button. I am trying to create the .frg file in order to run the runCA command in the Celera Assembler.
  • Staging failed: Buildpack compilation step failed Using NPM or Yarn. By default, the Node.js buildpack assumes you are using NPM. If you want to use Yarn instead, you must provide a yarn.lock in your top-level app directory. For more information on the Yarn lock file, see yarn.lock in the Yarn documentation. Vendoring App Dependencies
  • Command Task Failed with exit code 9 venkatsai Jun 25, 2013 9:09 AM ( in response to user189660 ) Please let me know the exactly what you are added in custom properties,because I am also facing similar issue.
  • On a Unix system, including Mac OS X, run a traceroute at the command line like this: traceroute server.name. If the traceroute command is not found, it may be present but not in your shell's search path. On some systems, traceroute can be found in /usr/sbin, which is often not in the default user path. In this case, run it with the full path:
  • Process exited with an error: 139 (Exit value: 139) -> [Help 1] org.apache.maven.lifecycle.LifecycleExecutionException: Failed to execute goal org.codehaus.mojo:exec-maven-plugin:1.2.1:exec (default-cli) on project sample-java-client: Command execution failed.

2005 saturn relay engine coolant temperature sensor location

  • Jun 18, 2015 · Hello, When I try to build or run my project on android. I have this errors report 'Error code 1 for command: ant with args: debug,-f,/Users/XXXX/Documents/works/XXXX ...
  • The Code of Federal Regulations is a codification of the general and permanent rules published in the Federal Register by the Executive departments and agencies of the Federal Government. The Code is divided into 50 titles which represent broad areas subject to Federal regulation.
  • 今回はCommand failed.となっているutf-8-validateというモジュールが原因のようなので、そこから探っていきます。 package.jsonのdependenciesには記載のないモジュールのため、使用しているなんらかのモジュールが依存しているモジュールであることがわかります。
  • サマリ yarn + webpack導入 es6を動かす es6で書いたコードを動かす どうしてyarnにしてのか yarnとは? ... Command failed with exit code 2 ...
  • CDH 5.4 . I am running my spark streaming application using spark-submit on yarn-cluster. When I run it on local mode it is working fine. But when I try to run it on yarn-cluster using spark-submit, it runs for some time and then exits with following execption
  • Nov 17, 2020 · Hi, I have installed Sage via composer, following the documentation. Then I have Installed the latest Yarn version and downloaded all the dependencies via “yarn” command.
  • Usage: command [arguments] [options] Global Options: --env Set NODE_ENV before running the commands --no-ansi Disable colored output Available Commands: seed Seed database using seed files migration migration:refresh Refresh migrations by performing rollback and then running from start migration:reset Rollback migration to the first batch migration:rollback Rollback migration to latest batch ...
  • The error details are pasted below: Starting mongod: about to fork child process, waiting until server is ready for connections. This includes the steps to dump Mongo DB collections. AWS cli command to move to S3 bucket. A simple bash script for automation purpose.
  • Oct 13, 2013 · Application application_1449234563003_0177 failed 2 times due to AM Container for appattempt_1449234563003_0177_000002 exited with exitCode: 1 due to: Exception from container-launch. Container id: container_1449234563003_0177_02_000001 Exit code: 1 Stack trace: ExitCodeException exitCode=1:
  • Nov 17, 2020 · Hi, I have installed Sage via composer, following the documentation. Then I have Installed the latest Yarn version and downloaded all the dependencies via “yarn” command.
  • error Command failed with exit code 134. 2019-05-14T14:05:21.117924+00:00 app[web.1]: info Visit https That looks like it's a problem with the Node.js (or a library's) C++ source code. Are you including node_modules/ when you deploy, or do you let Heroku install dependencies itself?
  • Because of VS Code's limitation, if you are using VS Code stable release and try to run the integration test on CLI, it will throw an error: Running extension tests from the command line is currently only supported if no other instance of Code is running.
  • I can’t add platform android. I’ve been trying to fix this all day but to no avail (uninstalled and reinstalled node, npm, deleted all npm folders, tried to fix the PATH…). Using node 0.12.5, npm 2.11.2, cordova 5.1.1, ionic 1.5.5 on Windows 7. $ ionic platform add android Updated the hooks directory to have execute permissions Adding android project… Error: cmd: Command failed with ...
  • Michael lives in sunny Mountain View, California. He started programming with an Apple //e in 4th grade, graduated from UCLA with a math degree in 1994, and immediately landed a job as a QA engineer at Symantec, working on the Norton AntiVirus team.
  • I wrote the above example looking at the code of W. Richard Stevens' book "Advanced Programming in the Unix Environment" and then modified it by comparing it to the FreeBSD popen source code. Web links. FreeBSD popenThis is the exact version of the FreeBSD source code I referred to.
  • Exit codes are a number between 0 and 255, which is returned by any Unix command when it returns control to its parent process. Success is traditionally represented with exit 0; failure is normally indicated with a non-zero exit-code. This value can indicate different reasons for failure.
  • Inkydjango (talk contribs) . So I have done this process, but it is still not running. The command line is OK. The create PDF page from special page is OK, but the create book on the main nenu NOK.
  • gyp ERR! stack Error: `C:\\Windows\\Microsoft.NET\\Framework\\v4.0.30319\\msbuild.exe` failed with exit code: 1 解决办法 1. npm install -g node-gyp 2. npm install --global --production windows-build-tools
  • The error details are pasted below: Starting mongod: about to fork child process, waiting until server is ready for connections. This includes the steps to dump Mongo DB collections. AWS cli command to move to S3 bucket. A simple bash script for automation purpose.
  • If you get an error Minecraft closed with exit code: -1073740791, there will be a decision with all the necessary actions in this article. This error can occur because of an update NVIDIA graphics driver to version 378.49. The symptoms are: a bug when running Minecraft with code -1073740791 or...
Valvoline vs castrol high mileage
A list of Yarn's error codes with detailed explanations. This usually occurs in only two cases: either the package never has been built before, or its previous build failed (returned a non-zero exit code). This error will be generated when Yarn detects that your project references a package that isn't listed...
55d23l battery
@monoid What a fiasco! The electron7 package was dropped from [community] but there is an AUR package eletron7-bin that provides it. You can use that. This is actually available for 8 too and I didn't want to go down the road of using an AUR bin package, but there is less and less options available to us.
Warzone searching for a match 5000ms ping
TASK ERROR: start failed: command '/usr/bin/kvm -id 100 -chardev 'socket,id=qmp,path E9:F0:74:81,netdev=net0,bus=pci.0,addr=0x12,id=net0,bootindex=300'' failed: exit code 1. (400). net1: hotplug problem - VM 1003 qmp command 'netdev_add' failed - Device 'tap' could not be...
Divorce laws in florida alimony
and when I ran `yarn install`, I got: yarn install v1.2.0 [1/4] Resolving packages... error Command failed. Exit code: 1 Command: git Arguments fatal: sent error to the client: git upload-archive: archiver died with error remote: fatal: pathspec 'package.json' did not match any files remote: git...

Laavsath ghost

  • Which elephant (left or right) has both the largest and smallest fragments_
  • Agero ticket
  • 2018 subaru forester timing belt or chain
  • Pc37x review reddit
  • Salt water sandals womens size 5
  • 5700 xt screws
  • Student exploration sticky molecules gizmo answer key
  • Weight watchers plan in 1977
  • Xrdp rpm centos 7
  • Squashfs fuse
  • Telecharger jeux casino machine a sous gratuit
  • Interrupt u boot
  • Tableau dual axis map separate filters
  • 04 kx250f valve clearance
  • Ir light oculus
  • error Command failed with exit code 134. 2019-05-14T14:05:21.117924+00:00 app[web.1]: info Visit https That looks like it's a problem with the Node.js (or a library's) C++ source code. Are you including node_modules/ when you deploy, or do you let Heroku install dependencies itself?
    DNS Update failed: ERROR_DNS_UPDATE_FAILED When joining a host to an Active Directory (AD), the net fails to update the DNS: # net ads join -U administrator Enter administrator's password: Using short domain name -- SAMDOM Joined 'M1' to dns domain 'samdom.example.com' DNS Update for m1.samdom.example.com failed: ERROR_DNS_UPDATE_FAILED DNS ...
    Grafana allow anonymous access
    Unidad 3 leccion 2 answer key
  • Yeni launcher pro apk
  • Literacy test slate
  • Constant acceleration problems with answers
  • Aapc chapter 8 practical application answers
  • Brassicyl isoleucinate esylate safe
  • Npc universe 2020
  • Kingo root 90 percent fail
  • How to hotwire a 2000 ford explorer
  • Marlin 336 upgrades
  • Vizio sb3621n e8 firmware update
  • Dawbench results
  • Photos not uploading to icloud from pc
  • Y8 games gun mayhem 4
  • Ojibwe spirit name
  • S14 kouki front clip
  • Uc personal insight questions transfer examples
  • Kidibuzz wifi authentication problem
  • Fiber optic rod sizes
  • Phone rings once then goes to voicemail
  • Ixl answers 7th grade language arts
  • Burning skin anxiety
  • Paychex eib
    Chevy 6.0 ticking noise
  • Ridgid r4222 parts
  • Como ver canales colombianos en estados unidos
  • Navy boot camp yearbook
  • Why does onlyfans say i need to add another payment card
  • Cat c30 vs c32
  • Uefi boot order
  • How do you turn on power ups in rocket league
  • Kbd67 pcb layout
  • Aftermarket assassins clutch weight chart
  • Zoom instructions for elderly
  • Pa treskmod
  • Metaphone python github
  • Liftmaster 8550 vs 8550w
  • Patty rich gurnee puppy mill
  • Is fbi season 1 on cbs all access
  • Skutt kilns india
  • Dnd dice holder
  • Nissan navara d22 crank angle sensor
  • Takeuchi tb1140 lifting capacity
  • Tmc2209 tmc connection error
  • Aloevera huua bacteria mwilini
  • Fargo dtc1250e issues
  • Diesel truck codes
  • Lga775 16gb ram
  • How to connect iphone to onkyo receiver
  • Michigan uia issue closed level 1
  • Turbo 400 shifter
  • Semi monthly timesheet calculator
  • Legacy homes owner
  • Forest edge maine coons
  • Fresno county jail covid
  • Nzbhydra port
  • Rhcsa reddit
  • Japanese music flac download
  • Bobcat oil filter cross reference 7012303
  • Regex remove domain from url
  • Whirlpool refrigerator water filter reset
  • Lewis county ny tax sale 2020
  • S10 sas coil spring kit
  • Royalty free opera vocals
  • Thermal energy reading comprehension
  • Dua to stop rain

Direct variation equation word problems
Razer kraken 7.1 v2 best settings for gaming

Oil field trucking jobs near me
My ex best friend mgk download mp3